Test results
1 suite, 1 failed test
org.eclipse.che.selenium.miscellaneous.DialogAboutTest
dialogAboutTest
org.testng.TestException: Failed to inject fields in org.eclipse.che.selenium.miscellaneous.DialogAboutTest at org.eclipse.che.selenium.core.inject.SeleniumTestHandler.beforeInvocation(SeleniumTestHandler.java:263) at java.util.concurrent.ThreadPoolExecutor.runWorker(ThreadPoolExecutor.java:1149) at java.util.concurrent.ThreadPoolExecutor$Worker.run(ThreadPoolExecutor.java:624) at java.lang.Thread.run(Thread.java:748) Caused by: com.google.inject.ProvisionException: Unable to provision, see the following errors: 1) Error in custom provider, java.util.concurrent.ExecutionException: java.lang.IllegalStateException: Workspace with name='workspacezk60qv' id='workspaceocdrad39kngaetos' start failed. at org.eclipse.che.selenium.core.CheSeleniumSuiteModule.getWorkspace(CheSeleniumSuiteModule.java:168) while locating org.eclipse.che.selenium.core.workspace.TestWorkspace for field at org.eclipse.che.selenium.miscellaneous.DialogAboutTest.testWorkspace(DialogAboutTest.java:26) while locating org.eclipse.che.selenium.miscellaneous.DialogAboutTest 1 error at com.google.inject.internal.InternalProvisionException.toProvisionException(InternalProvisionException.java:226) at com.google.inject.internal.MembersInjectorImpl.injectMembers(MembersInjectorImpl.java:73) at com.google.inject.internal.InjectorImpl.injectMembers(InjectorImpl.java:1014) at org.eclipse.che.selenium.core.inject.SeleniumTestHandler.injectDependencies(SeleniumTestHandler.java:329) at org.eclipse.che.selenium.core.inject.SeleniumTestHandler.beforeInvocation(SeleniumTestHandler.java:259) ... 11 more Caused by: java.util.concurrent.ExecutionException: java.lang.IllegalStateException: Workspace with name='workspacezk60qv' id='workspaceocdrad39kngaetos' start failed. at java.util.concurrent.CompletableFuture.reportGet(CompletableFuture.java:357) at java.util.concurrent.CompletableFuture.get(CompletableFuture.java:1895) at org.eclipse.che.selenium.core.workspace.CheTestWorkspace.await(CheTestWorkspace.java:129) at org.eclipse.che.selenium.core.CheSeleniumSuiteModule.getWorkspace(CheSeleniumSuiteModule.java:169) at org.eclipse.che.selenium.core.CheSeleniumSuiteModule$$FastClassByGuice$$87827f64.invoke(<generated>) at com.google.inject.internal.ProviderMethod$FastClassProviderMethod.doProvision(ProviderMethod.java:264) at com.google.inject.internal.ProviderMethod.doProvision(ProviderMethod.java:173) at com.google.inject.internal.InternalProviderInstanceBindingImpl$CyclicFactory.provision(InternalProviderInstanceBindingImpl.java:185) at com.google.inject.internal.InternalProviderInstanceBindingImpl$CyclicFactory.get(InternalProviderInstanceBindingImpl.java:162) at com.google.inject.internal.SingleFieldInjector.inject(SingleFieldInjector.java:52) at com.google.inject.internal.MembersInjectorImpl.injectMembers(MembersInjectorImpl.java:147) at com.google.inject.internal.MembersInjectorImpl.injectAndNotify(MembersInjectorImpl.java:101) at com.google.inject.internal.MembersInjectorImpl.injectMembers(MembersInjectorImpl.java:71) ... 14 more Caused by: java.lang.IllegalStateException: Workspace with name='workspacezk60qv' id='workspaceocdrad39kngaetos' start failed. at org.eclipse.che.selenium.core.workspace.CheTestWorkspace.lambda$new$1(CheTestWorkspace.java:104) at java.util.concurrent.CompletableFuture$AsyncRun.run(CompletableFuture.java:1626) at java.util.concurrent.CompletableFuture$AsyncRun.exec(CompletableFuture.java:1618) at java.util.concurrent.ForkJoinTask.doExec(ForkJoinTask.java:289) at java.util.concurrent.ForkJoinPool$WorkQueue.runTask(ForkJoinPool.java:1056) at java.util.concurrent.ForkJoinPool.runWorker(ForkJoinPool.java:1692) at java.util.concurrent.ForkJoinWorkerThread.run(ForkJoinWorkerThread.java:157) Caused by: java.util.concurrent.TimeoutException: Expected condition failed: waiting for 600 SECONDS with 1000 MILLISECONDS interval at org.eclipse.che.selenium.core.utils.WaitUtils.waitSuccessCondition(WaitUtils.java:96) at org.eclipse.che.selenium.core.client.AbstractTestWorkspaceServiceClient.waitWorkspaceStart(AbstractTestWorkspaceServiceClient.java:151) at org.eclipse.che.selenium.core.client.CheTestWorkspaceServiceClient.start(CheTestWorkspaceServiceClient.java:85) at org.eclipse.che.selenium.core.workspace.CheTestWorkspace.lambda$new$1(CheTestWorkspace.java:83) ... 6 more ... Removed 8 stack frames
com.redhat.che.functional.tests.BayesianPomXml
checkErrorPresentAfterReopenFile
org.testng.SkipException: Bayesian error not present - known issue: https://github.com/redhat-developer/rh-che/issues/1256. at com.redhat.che.functional.tests.BayesianPomXml.editorCheckBayesianError(BayesianPomXml.java:85) at com.redhat.che.functional.tests.BayesianAbstractTestClass.checkErrorPresentAfterReopenFile(BayesianAbstractTestClass.java:115) at java.util.concurrent.ThreadPoolExecutor.runWorker(ThreadPoolExecutor.java:1149) at java.util.concurrent.ThreadPoolExecutor$Worker.run(ThreadPoolExecutor.java:624) at java.lang.Thread.run(Thread.java:748) ... Removed 10 stack frames
com.redhat.che.functional.tests.BayesianPackageJson
checkBayesianError
checkErrorPresentAfterReopenFile
com.redhat.che.functional.tests.BayesianPomXml
checkBayesianError
com.redhat.che.functional.tests.BuildAndRunProjectTest
runProjectBuild
/root/rh-che/functional-tests/src/test/resources/suites/flaky.xml
<?xml version="1.0" encoding="UTF-8"?>
<!DOCTYPE suite SYSTEM "http://testng.org/testng-1.0.dtd">
<suite thread-count="1" configfailurepolicy="continue" verbose="0" name="Suite for flaky tests" parallel="classes">
  <test name="all">
    <groups>
      <run>
        <exclude name="github"/>
      </run>
    </groups>
    <classes>
      <class name="org.eclipse.che.selenium.miscellaneous.DialogAboutTest"/>
      <class name="com.redhat.che.functional.tests.BuildAndRunProjectTest"/>
      <class name="com.redhat.che.functional.tests.BayesianPackageJson"/>
      <class name="com.redhat.che.functional.tests.BayesianPomXml"/>
    </classes>
  </test> <!-- all -->
</suite> <!-- Suite for flaky tests -->
            
Tests for Suite for flaky tests
  • all (4 classes)
Groups for Suite for flaky tests
Times for Suite for flaky tests
Total running time: 11 minutes
Reporter output for Suite for flaky tests
0 ignored methods
Methods in chronological order
com.redhat.che.functional.tests.BuildAndRunProjectTest
checkWorkspace 0 ms
runProjectBuild 255898 ms
com.redhat.che.functional.tests.BayesianPackageJson
setUp 291365 ms
prepareProjectFile 748825 ms
checkBayesianError 768559 ms
closeFiles 778963 ms
prepareProjectFile 794091 ms
checkErrorPresentAfterReopenFile 813483 ms
closeFiles 835406 ms
closeBrowserAfterTest 850722 ms
com.redhat.che.functional.tests.BayesianPomXml
setUp 850775 ms
prepareProjectFile 918398 ms
checkBayesianError 940470 ms
closeFiles 951030 ms
prepareProjectFile 971145 ms
checkErrorPresentAfterReopenFile 992902 ms
closeFiles 1025066 ms
closeBrowserAfterTest 1044496 ms