Test results
1 suite, 1 failed test
org.eclipse.che.selenium.miscellaneous.DialogAboutTest
dialogAboutTest
org.openqa.selenium.TimeoutException: Expected condition failed: waiting for visibility of element located by By.id: gwt-debug-projectTree (tried for 240 second(s) with 500 MILLISECONDS interval) Build info: version: '3.0.1', revision: '1969d75', time: '2016-10-18 09:49:13 -0700' System info: host: 'a0431781f32b', ip: '172.17.0.2', os.name: 'Linux', os.arch: 'amd64', os.version: '3.10.0-957.12.2.el7.x86_64', java.version: '1.8.0_212' Driver info: org.eclipse.che.selenium.core.SeleniumWebDriver at org.openqa.selenium.support.ui.WebDriverWait.timeoutException(WebDriverWait.java:80) at org.openqa.selenium.support.ui.FluentWait.until(FluentWait.java:265) at org.eclipse.che.selenium.core.webdriver.SeleniumWebDriverHelper.waitVisibility(SeleniumWebDriverHelper.java:151) at org.eclipse.che.selenium.pageobject.ProjectExplorer.waitProjectExplorer(ProjectExplorer.java:273) at org.eclipse.che.selenium.pageobject.Ide.waitOpenedWorkspaceIsReadyToUse(Ide.java:74) at org.eclipse.che.selenium.pageobject.Ide.waitOpenedWorkspaceIsReadyToUse(Ide.java:70) at org.eclipse.che.selenium.miscellaneous.DialogAboutTest.dialogAboutTest(DialogAboutTest.java:38) at java.util.concurrent.ThreadPoolExecutor.runWorker(ThreadPoolExecutor.java:1149) at java.util.concurrent.ThreadPoolExecutor$Worker.run(ThreadPoolExecutor.java:624) at java.lang.Thread.run(Thread.java:748) Caused by: org.openqa.selenium.NoSuchElementException: no such element: Unable to locate element: {"method":"id","selector":"gwt-debug-projectTree"} (Session info: chrome=74.0.3729.157) (Driver info: chromedriver=74.0.3729.6 (255758eccf3d244491b8a1317aa76e1ce10d57e9-refs/branch-heads/3729@{#29}),platform=Linux 3.10.0-957.12.2.el7.x86_64 x86_64) (WARNING: The server did not provide any stacktrace information) Command duration or timeout: 17 milliseconds For documentation on this error, please visit: http://seleniumhq.org/exceptions/no_such_element.html Build info: version: '3.0.1', revision: '1969d75', time: '2016-10-18 09:49:13 -0700' System info: host: 'a0431781f32b', ip: '172.17.0.2', os.name: 'Linux', os.arch: 'amd64', os.version: '3.10.0-957.12.2.el7.x86_64', java.version: '1.8.0_212' Driver info: org.openqa.selenium.remote.RemoteWebDriver Capabilities [{mobileEmulationEnabled=false, timeouts={implicit=0, pageLoad=300000, script=30000}, hasTouchScreen=false, platform=LINUX, acceptSslCerts=false, goog:chromeOptions={debuggerAddress=localhost:42603}, acceptInsecureCerts=false, webStorageEnabled=true, browserName=chrome, takesScreenshot=true, javascriptEnabled=true, setWindowRect=true, unexpectedAlertBehaviour=ignore, applicationCacheEnabled=false, rotatable=false, networkConnectionEnabled=false, chrome={chromedriverVersion=74.0.3729.6 (255758eccf3d244491b8a1317aa76e1ce10d57e9-refs/branch-heads/3729@{#29}), userDataDir=/tmp/.com.google.Chrome.mCc8vq}, takesHeapSnapshot=true, pageLoadStrategy=normal, strictFileInteractability=false, databaseEnabled=false, handlesAlerts=true, version=74.0.3729.157, browserConnectionEnabled=false, proxy={}, nativeEvents=true, locationContextEnabled=true, cssSelectorsEnabled=true}] Session ID: 5bce3f737c93f4db0a4baef5cf0e1f1f *** Element info: {Using=id, value=gwt-debug-projectTree} at org.openqa.selenium.remote.ErrorHandler.createThrowable(ErrorHandler.java:216) at org.openqa.selenium.remote.ErrorHandler.throwIfResponseFailed(ErrorHandler.java:168) at org.openqa.selenium.remote.RemoteWebDriver.execute(RemoteWebDriver.java:635) at org.openqa.selenium.remote.RemoteWebDriver.findElement(RemoteWebDriver.java:368) at org.openqa.selenium.remote.RemoteWebDriver.findElementById(RemoteWebDriver.java:417) at org.openqa.selenium.By$ById.findElement(By.java:218) at org.openqa.selenium.remote.RemoteWebDriver.findElement(RemoteWebDriver.java:360) at org.eclipse.che.selenium.core.SeleniumWebDriver.findElement(SeleniumWebDriver.java:133) at org.openqa.selenium.support.ui.ExpectedConditions.findElement(ExpectedConditions.java:895) at org.openqa.selenium.support.ui.ExpectedConditions.access$000(ExpectedConditions.java:41) at org.openqa.selenium.support.ui.ExpectedConditions$7.apply(ExpectedConditions.java:205) at org.openqa.selenium.support.ui.ExpectedConditions$7.apply(ExpectedConditions.java:201) at org.openqa.selenium.support.ui.FluentWait.until(FluentWait.java:238) ... 18 more ... Removed 13 stack frames
com.redhat.che.functional.tests.BayesianPomXml
checkErrorPresentAfterReopenFile
org.testng.SkipException: Bayesian error not present - known issue: https://github.com/redhat-developer/rh-che/issues/1256. at com.redhat.che.functional.tests.BayesianPomXml.editorCheckBayesianError(BayesianPomXml.java:85) at com.redhat.che.functional.tests.BayesianAbstractTestClass.checkErrorPresentAfterReopenFile(BayesianAbstractTestClass.java:115) at java.util.concurrent.ThreadPoolExecutor.runWorker(ThreadPoolExecutor.java:1149) at java.util.concurrent.ThreadPoolExecutor$Worker.run(ThreadPoolExecutor.java:624) at java.lang.Thread.run(Thread.java:748) ... Removed 10 stack frames
com.redhat.che.functional.tests.BayesianPackageJson
checkBayesianError
checkErrorPresentAfterReopenFile
com.redhat.che.functional.tests.BayesianPomXml
checkBayesianError
com.redhat.che.functional.tests.Che7DialogAbout
openDialogAbout
com.redhat.che.functional.tests.BuildAndRunProjectTest
runProjectBuild
/root/rh-che/functional-tests/src/test/resources/suites/simpleTestSuite.xml
<?xml version="1.0" encoding="UTF-8"?>
<!DOCTYPE suite SYSTEM "http://testng.org/testng-1.0.dtd">
<suite thread-count="1" configfailurepolicy="continue" verbose="0" name="Simple test suite" parallel="classes">
  <test name="all">
    <groups>
      <run>
        <exclude name="github"/>
      </run>
    </groups>
    <classes>
      <class name="org.eclipse.che.selenium.miscellaneous.DialogAboutTest"/>
      <class name="com.redhat.che.functional.tests.BuildAndRunProjectTest"/>
      <class name="com.redhat.che.functional.tests.BayesianPackageJson"/>
      <class name="com.redhat.che.functional.tests.BayesianPomXml"/>
      <class name="com.redhat.che.functional.tests.Che7DialogAbout"/>
    </classes>
  </test> <!-- all -->
</suite> <!-- Simple test suite -->
            
Tests for Simple test suite
  • all (5 classes)
Groups for Simple test suite
Times for Simple test suite
Total running time: 6 minutes
Reporter output for Simple test suite
0 ignored methods
Methods in chronological order
org.eclipse.che.selenium.miscellaneous.DialogAboutTest
dialogAboutTest 0 ms
com.redhat.che.functional.tests.BuildAndRunProjectTest
checkWorkspace 297871 ms
runProjectBuild 408778 ms
com.redhat.che.functional.tests.BayesianPackageJson
setUp 441528 ms
prepareProjectFile 509243 ms
checkBayesianError 528978 ms
closeFiles 539403 ms
prepareProjectFile 554109 ms
checkErrorPresentAfterReopenFile 573341 ms
closeFiles 595774 ms
closeBrowserAfterTest 610405 ms
com.redhat.che.functional.tests.BayesianPomXml
setUp 610459 ms
prepareProjectFile 816201 ms
checkBayesianError 838620 ms
closeFiles 849359 ms
prepareProjectFile 868515 ms
checkErrorPresentAfterReopenFile 889807 ms
closeFiles 921774 ms
closeBrowserAfterTest 941378 ms
com.redhat.che.functional.tests.Che7DialogAbout
createAndOpenWorkspace 941431 ms
openDialogAbout 1111213 ms
tearDown 1111549 ms