Test results
1 suite, 1 failed test
org.eclipse.che.selenium.miscellaneous.DialogAboutTest
dialogAboutTest
org.testng.TestException: Failed to inject fields in org.eclipse.che.selenium.miscellaneous.DialogAboutTest at org.eclipse.che.selenium.core.inject.SeleniumTestHandler.beforeInvocation(SeleniumTestHandler.java:263) at java.util.concurrent.ThreadPoolExecutor.runWorker(ThreadPoolExecutor.java:1149) at java.util.concurrent.ThreadPoolExecutor$Worker.run(ThreadPoolExecutor.java:624) at java.lang.Thread.run(Thread.java:748) Caused by: com.google.inject.ProvisionException: Unable to provision, see the following errors: 1) Error in custom provider, java.util.concurrent.ExecutionException: java.lang.IllegalStateException: Workspace with name='workspace1y028o' id='workspacetct6wguhtimxzb53' start failed. at org.eclipse.che.selenium.core.CheSeleniumSuiteModule.getWorkspace(CheSeleniumSuiteModule.java:168) while locating org.eclipse.che.selenium.core.workspace.TestWorkspace for field at org.eclipse.che.selenium.miscellaneous.DialogAboutTest.testWorkspace(DialogAboutTest.java:26) while locating org.eclipse.che.selenium.miscellaneous.DialogAboutTest 1 error at com.google.inject.internal.InternalProvisionException.toProvisionException(InternalProvisionException.java:226) at com.google.inject.internal.MembersInjectorImpl.injectMembers(MembersInjectorImpl.java:73) at com.google.inject.internal.InjectorImpl.injectMembers(InjectorImpl.java:1014) at org.eclipse.che.selenium.core.inject.SeleniumTestHandler.injectDependencies(SeleniumTestHandler.java:329) at org.eclipse.che.selenium.core.inject.SeleniumTestHandler.beforeInvocation(SeleniumTestHandler.java:259) ... 11 more Caused by: java.util.concurrent.ExecutionException: java.lang.IllegalStateException: Workspace with name='workspace1y028o' id='workspacetct6wguhtimxzb53' start failed. at java.util.concurrent.CompletableFuture.reportGet(CompletableFuture.java:357) at java.util.concurrent.CompletableFuture.get(CompletableFuture.java:1895) at org.eclipse.che.selenium.core.workspace.CheTestWorkspace.await(CheTestWorkspace.java:129) at org.eclipse.che.selenium.core.CheSeleniumSuiteModule.getWorkspace(CheSeleniumSuiteModule.java:169) at org.eclipse.che.selenium.core.CheSeleniumSuiteModule$$FastClassByGuice$$87827f64.invoke(<generated>) at com.google.inject.internal.ProviderMethod$FastClassProviderMethod.doProvision(ProviderMethod.java:264) at com.google.inject.internal.ProviderMethod.doProvision(ProviderMethod.java:173) at com.google.inject.internal.InternalProviderInstanceBindingImpl$CyclicFactory.provision(InternalProviderInstanceBindingImpl.java:185) at com.google.inject.internal.InternalProviderInstanceBindingImpl$CyclicFactory.get(InternalProviderInstanceBindingImpl.java:162) at com.google.inject.internal.SingleFieldInjector.inject(SingleFieldInjector.java:52) at com.google.inject.internal.MembersInjectorImpl.injectMembers(MembersInjectorImpl.java:147) at com.google.inject.internal.MembersInjectorImpl.injectAndNotify(MembersInjectorImpl.java:101) at com.google.inject.internal.MembersInjectorImpl.injectMembers(MembersInjectorImpl.java:71) ... 14 more Caused by: java.lang.IllegalStateException: Workspace with name='workspace1y028o' id='workspacetct6wguhtimxzb53' start failed. at org.eclipse.che.selenium.core.workspace.CheTestWorkspace.lambda$new$1(CheTestWorkspace.java:104) at java.util.concurrent.CompletableFuture$AsyncRun.run(CompletableFuture.java:1626) at java.util.concurrent.CompletableFuture$AsyncRun.exec(CompletableFuture.java:1618) at java.util.concurrent.ForkJoinTask.doExec(ForkJoinTask.java:289) at java.util.concurrent.ForkJoinPool$WorkQueue.runTask(ForkJoinPool.java:1056) at java.util.concurrent.ForkJoinPool.runWorker(ForkJoinPool.java:1692) at java.util.concurrent.ForkJoinWorkerThread.run(ForkJoinWorkerThread.java:157) Caused by: java.util.concurrent.TimeoutException: Expected condition failed: waiting for 600 SECONDS with 1000 MILLISECONDS interval at org.eclipse.che.selenium.core.utils.WaitUtils.waitSuccessCondition(WaitUtils.java:96) at org.eclipse.che.selenium.core.client.AbstractTestWorkspaceServiceClient.waitWorkspaceStart(AbstractTestWorkspaceServiceClient.java:151) at org.eclipse.che.selenium.core.client.CheTestWorkspaceServiceClient.start(CheTestWorkspaceServiceClient.java:85) at org.eclipse.che.selenium.core.workspace.CheTestWorkspace.lambda$new$1(CheTestWorkspace.java:83) ... 6 more ... Removed 8 stack frames
com.redhat.che.functional.tests.BayesianPomXml
checkBayesianError
checkErrorPresentAfterReopenFile
com.redhat.che.functional.tests.Che7DialogAbout
openDialogAbout
com.redhat.che.functional.tests.BayesianPackageJson
checkBayesianError
checkErrorPresentAfterReopenFile
com.redhat.che.functional.tests.BuildAndRunProjectTest
runProjectBuild
/root/rh-che/functional-tests/src/test/resources/suites/simpleTestSuite.xml
<?xml version="1.0" encoding="UTF-8"?>
<!DOCTYPE suite SYSTEM "http://testng.org/testng-1.0.dtd">
<suite thread-count="1" configfailurepolicy="continue" verbose="0" name="Simple test suite" parallel="classes">
  <test name="all">
    <groups>
      <run>
        <exclude name="github"/>
      </run>
    </groups>
    <classes>
      <class name="org.eclipse.che.selenium.miscellaneous.DialogAboutTest"/>
      <class name="com.redhat.che.functional.tests.BuildAndRunProjectTest"/>
      <class name="com.redhat.che.functional.tests.BayesianPackageJson"/>
      <class name="com.redhat.che.functional.tests.BayesianPomXml"/>
      <class name="com.redhat.che.functional.tests.Che7DialogAbout"/>
    </classes>
  </test> <!-- all -->
</suite> <!-- Simple test suite -->
            
Tests for Simple test suite
  • all (5 classes)
Groups for Simple test suite
Times for Simple test suite
Total running time: 11 minutes
Reporter output for Simple test suite
0 ignored methods
Methods in chronological order
com.redhat.che.functional.tests.BuildAndRunProjectTest
checkWorkspace 0 ms
runProjectBuild 508172 ms
com.redhat.che.functional.tests.BayesianPackageJson
setUp 543379 ms
prepareProjectFile 965137 ms
checkBayesianError 988800 ms
closeFiles 1000272 ms
prepareProjectFile 1017915 ms
checkErrorPresentAfterReopenFile 1040774 ms
closeFiles 1066763 ms
closeBrowserAfterTest 1084038 ms
com.redhat.che.functional.tests.BayesianPomXml
checkBayesianError 1686907 ms
checkErrorPresentAfterReopenFile 1686909 ms
com.redhat.che.functional.tests.Che7DialogAbout
createAndOpenWorkspace 1686911 ms
openDialogAbout 1961743 ms