Test results
1 suite, 1 failed test
org.eclipse.che.selenium.miscellaneous.DialogAboutTest
dialogAboutTest
org.testng.TestException: Failed to inject fields in org.eclipse.che.selenium.miscellaneous.DialogAboutTest at org.eclipse.che.selenium.core.inject.SeleniumTestHandler.beforeInvocation(SeleniumTestHandler.java:263) at java.util.concurrent.ThreadPoolExecutor.runWorker(ThreadPoolExecutor.java:1149) at java.util.concurrent.ThreadPoolExecutor$Worker.run(ThreadPoolExecutor.java:624) at java.lang.Thread.run(Thread.java:748) Caused by: com.google.inject.ProvisionException: Unable to provision, see the following errors: 1) Error in custom provider, java.util.concurrent.ExecutionException: java.lang.IllegalStateException: Workspace with name='workspace5z17hq' id='workspacewydctkj7m0gkicdc' start failed. at org.eclipse.che.selenium.core.CheSeleniumSuiteModule.getWorkspace(CheSeleniumSuiteModule.java:168) while locating org.eclipse.che.selenium.core.workspace.TestWorkspace for field at org.eclipse.che.selenium.miscellaneous.DialogAboutTest.testWorkspace(DialogAboutTest.java:26) while locating org.eclipse.che.selenium.miscellaneous.DialogAboutTest 1 error at com.google.inject.internal.InternalProvisionException.toProvisionException(InternalProvisionException.java:226) at com.google.inject.internal.MembersInjectorImpl.injectMembers(MembersInjectorImpl.java:73) at com.google.inject.internal.InjectorImpl.injectMembers(InjectorImpl.java:1014) at org.eclipse.che.selenium.core.inject.SeleniumTestHandler.injectDependencies(SeleniumTestHandler.java:329) at org.eclipse.che.selenium.core.inject.SeleniumTestHandler.beforeInvocation(SeleniumTestHandler.java:259) ... 11 more Caused by: java.util.concurrent.ExecutionException: java.lang.IllegalStateException: Workspace with name='workspace5z17hq' id='workspacewydctkj7m0gkicdc' start failed. at java.util.concurrent.CompletableFuture.reportGet(CompletableFuture.java:357) at java.util.concurrent.CompletableFuture.get(CompletableFuture.java:1895) at org.eclipse.che.selenium.core.workspace.CheTestWorkspace.await(CheTestWorkspace.java:129) at org.eclipse.che.selenium.core.CheSeleniumSuiteModule.getWorkspace(CheSeleniumSuiteModule.java:169) at org.eclipse.che.selenium.core.CheSeleniumSuiteModule$$FastClassByGuice$$87827f64.invoke(<generated>) at com.google.inject.internal.ProviderMethod$FastClassProviderMethod.doProvision(ProviderMethod.java:264) at com.google.inject.internal.ProviderMethod.doProvision(ProviderMethod.java:173) at com.google.inject.internal.InternalProviderInstanceBindingImpl$CyclicFactory.provision(InternalProviderInstanceBindingImpl.java:185) at com.google.inject.internal.InternalProviderInstanceBindingImpl$CyclicFactory.get(InternalProviderInstanceBindingImpl.java:162) at com.google.inject.internal.SingleFieldInjector.inject(SingleFieldInjector.java:52) at com.google.inject.internal.MembersInjectorImpl.injectMembers(MembersInjectorImpl.java:147) at com.google.inject.internal.MembersInjectorImpl.injectAndNotify(MembersInjectorImpl.java:101) at com.google.inject.internal.MembersInjectorImpl.injectMembers(MembersInjectorImpl.java:71) ... 14 more Caused by: java.lang.IllegalStateException: Workspace with name='workspace5z17hq' id='workspacewydctkj7m0gkicdc' start failed. at org.eclipse.che.selenium.core.workspace.CheTestWorkspace.lambda$new$1(CheTestWorkspace.java:104) at java.util.concurrent.CompletableFuture$AsyncRun.run(CompletableFuture.java:1626) at java.util.concurrent.CompletableFuture$AsyncRun.exec(CompletableFuture.java:1618) at java.util.concurrent.ForkJoinTask.doExec(ForkJoinTask.java:289) at java.util.concurrent.ForkJoinPool$WorkQueue.runTask(ForkJoinPool.java:1056) at java.util.concurrent.ForkJoinPool.runWorker(ForkJoinPool.java:1692) at java.util.concurrent.ForkJoinWorkerThread.run(ForkJoinWorkerThread.java:157) Caused by: java.util.concurrent.ExecutionException: java.lang.RuntimeException: Workspace with name 'workspace5z17hq' didn't start at java.util.concurrent.FutureTask.report(FutureTask.java:122) at java.util.concurrent.FutureTask.get(FutureTask.java:192) at org.eclipse.che.selenium.core.utils.WaitUtils.waitSuccessCondition(WaitUtils.java:101) at org.eclipse.che.selenium.core.client.AbstractTestWorkspaceServiceClient.waitWorkspaceStart(AbstractTestWorkspaceServiceClient.java:151) at org.eclipse.che.selenium.core.client.CheTestWorkspaceServiceClient.start(CheTestWorkspaceServiceClient.java:85) at org.eclipse.che.selenium.core.workspace.CheTestWorkspace.lambda$new$1(CheTestWorkspace.java:83) ... 6 more Caused by: java.lang.RuntimeException: Workspace with name 'workspace5z17hq' didn't start at org.eclipse.che.selenium.core.client.AbstractTestWorkspaceServiceClient.lambda$waitWorkspaceStart$2(AbstractTestWorkspaceServiceClient.java:169) at org.eclipse.che.selenium.core.utils.WaitUtils.lambda$waitSuccessCondition$0(WaitUtils.java:86) at java.util.concurrent.FutureTask.run(FutureTask.java:266) at java.util.concurrent.ThreadPoolExecutor.runWorker(ThreadPoolExecutor.java:1149) at java.util.concurrent.ThreadPoolExecutor$Worker.run(ThreadPoolExecutor.java:624) at java.lang.Thread.run(Thread.java:748) ... Removed 8 stack frames
com.redhat.che.functional.tests.BayesianPomXml
checkErrorPresentAfterReopenFile
org.testng.SkipException: Bayesian error not present - known issue: https://github.com/redhat-developer/rh-che/issues/1256. at com.redhat.che.functional.tests.BayesianPomXml.editorCheckBayesianError(BayesianPomXml.java:85) at com.redhat.che.functional.tests.BayesianAbstractTestClass.checkErrorPresentAfterReopenFile(BayesianAbstractTestClass.java:115) at java.util.concurrent.ThreadPoolExecutor.runWorker(ThreadPoolExecutor.java:1149) at java.util.concurrent.ThreadPoolExecutor$Worker.run(ThreadPoolExecutor.java:624) at java.lang.Thread.run(Thread.java:748) ... Removed 10 stack frames
com.redhat.che.functional.tests.BuildAndRunProjectTest
runProjectBuild
com.redhat.che.functional.tests.BayesianPackageJson
checkBayesianError
checkErrorPresentAfterReopenFile
com.redhat.che.functional.tests.BayesianPomXml
checkBayesianError
com.redhat.che.functional.tests.Che7DialogAbout
openDialogAbout
/root/rh-che/functional-tests/src/test/resources/suites/simpleTestSuite.xml
<?xml version="1.0" encoding="UTF-8"?>
<!DOCTYPE suite SYSTEM "http://testng.org/testng-1.0.dtd">
<suite thread-count="1" configfailurepolicy="continue" verbose="0" name="Simple test suite" parallel="classes">
  <test name="all">
    <groups>
      <run>
        <exclude name="github"/>
      </run>
    </groups>
    <classes>
      <class name="org.eclipse.che.selenium.miscellaneous.DialogAboutTest"/>
      <class name="com.redhat.che.functional.tests.BuildAndRunProjectTest"/>
      <class name="com.redhat.che.functional.tests.BayesianPackageJson"/>
      <class name="com.redhat.che.functional.tests.BayesianPomXml"/>
      <class name="com.redhat.che.functional.tests.Che7DialogAbout"/>
    </classes>
  </test> <!-- all -->
</suite> <!-- Simple test suite -->
            
Tests for Simple test suite
  • all (5 classes)
Groups for Simple test suite
Times for Simple test suite
Total running time: 10 minutes
Reporter output for Simple test suite
0 ignored methods
Methods in chronological order
com.redhat.che.functional.tests.BuildAndRunProjectTest
checkWorkspace 0 ms
runProjectBuild 67913 ms
com.redhat.che.functional.tests.BayesianPackageJson
setUp 102021 ms
prepareProjectFile 169414 ms
checkBayesianError 192139 ms
closeFiles 203544 ms
prepareProjectFile 220518 ms
checkErrorPresentAfterReopenFile 242168 ms
closeFiles 266952 ms
closeBrowserAfterTest 283316 ms
com.redhat.che.functional.tests.BayesianPomXml
setUp 283371 ms
prepareProjectFile 368225 ms
checkBayesianError 395290 ms
closeFiles 407078 ms
prepareProjectFile 428969 ms
checkErrorPresentAfterReopenFile 453620 ms
closeFiles 488854 ms
closeBrowserAfterTest 510903 ms
com.redhat.che.functional.tests.Che7DialogAbout
createAndOpenWorkspace 510958 ms
openDialogAbout 598542 ms
tearDown 599635 ms