Test results
1 suite, 1 failed test
org.eclipse.che.selenium.miscellaneous.DialogAboutTest
dialogAboutTest
org.openqa.selenium.TimeoutException: Expected condition failed: waiting for visibility of element located by By.id: gwt-debug-projectTree (tried for 240 second(s) with 500 MILLISECONDS interval) Build info: version: '3.0.1', revision: '1969d75', time: '2016-10-18 09:49:13 -0700' System info: host: 'ca36f8a15ae4', ip: '172.17.0.2', os.name: 'Linux', os.arch: 'amd64', os.version: '3.10.0-957.21.3.el7.x86_64', java.version: '1.8.0_212' Driver info: org.eclipse.che.selenium.core.SeleniumWebDriver at org.openqa.selenium.support.ui.WebDriverWait.timeoutException(WebDriverWait.java:80) at org.openqa.selenium.support.ui.FluentWait.until(FluentWait.java:265) at org.eclipse.che.selenium.core.webdriver.SeleniumWebDriverHelper.waitVisibility(SeleniumWebDriverHelper.java:151) at org.eclipse.che.selenium.pageobject.ProjectExplorer.waitProjectExplorer(ProjectExplorer.java:273) at org.eclipse.che.selenium.pageobject.Ide.waitOpenedWorkspaceIsReadyToUse(Ide.java:74) at org.eclipse.che.selenium.pageobject.Ide.waitOpenedWorkspaceIsReadyToUse(Ide.java:70) at org.eclipse.che.selenium.miscellaneous.DialogAboutTest.dialogAboutTest(DialogAboutTest.java:38) at java.util.concurrent.ThreadPoolExecutor.runWorker(ThreadPoolExecutor.java:1149) at java.util.concurrent.ThreadPoolExecutor$Worker.run(ThreadPoolExecutor.java:624) at java.lang.Thread.run(Thread.java:748) Caused by: org.openqa.selenium.NoSuchElementException: no such element: Unable to locate element: {"method":"id","selector":"gwt-debug-projectTree"} (Session info: chrome=75.0.3770.100) (Driver info: chromedriver=75.0.3770.140 (2d9f97485c7b07dc18a74666574f19176731995c-refs/branch-heads/3770@{#1155}),platform=Linux 3.10.0-957.21.3.el7.x86_64 x86_64) (WARNING: The server did not provide any stacktrace information) Command duration or timeout: 27 milliseconds For documentation on this error, please visit: http://seleniumhq.org/exceptions/no_such_element.html Build info: version: '3.0.1', revision: '1969d75', time: '2016-10-18 09:49:13 -0700' System info: host: 'ca36f8a15ae4', ip: '172.17.0.2', os.name: 'Linux', os.arch: 'amd64', os.version: '3.10.0-957.21.3.el7.x86_64', java.version: '1.8.0_212' Driver info: org.openqa.selenium.remote.RemoteWebDriver Capabilities [{mobileEmulationEnabled=false, timeouts={implicit=0, pageLoad=300000, script=30000}, hasTouchScreen=false, platform=LINUX, acceptSslCerts=false, goog:chromeOptions={debuggerAddress=localhost:41613}, acceptInsecureCerts=false, webStorageEnabled=true, browserName=chrome, takesScreenshot=true, javascriptEnabled=true, setWindowRect=true, unexpectedAlertBehaviour=ignore, applicationCacheEnabled=false, rotatable=false, networkConnectionEnabled=false, chrome={chromedriverVersion=75.0.3770.140 (2d9f97485c7b07dc18a74666574f19176731995c-refs/branch-heads/3770@{#1155}), userDataDir=/tmp/.com.google.Chrome.gRIuqG}, takesHeapSnapshot=true, pageLoadStrategy=normal, strictFileInteractability=false, databaseEnabled=false, handlesAlerts=true, version=75.0.3770.100, browserConnectionEnabled=false, proxy={}, nativeEvents=true, locationContextEnabled=true, cssSelectorsEnabled=true}] Session ID: e2aa93af0a89586e04f33c31e703470f *** Element info: {Using=id, value=gwt-debug-projectTree} at org.openqa.selenium.remote.ErrorHandler.createThrowable(ErrorHandler.java:216) at org.openqa.selenium.remote.ErrorHandler.throwIfResponseFailed(ErrorHandler.java:168) at org.openqa.selenium.remote.RemoteWebDriver.execute(RemoteWebDriver.java:635) at org.openqa.selenium.remote.RemoteWebDriver.findElement(RemoteWebDriver.java:368) at org.openqa.selenium.remote.RemoteWebDriver.findElementById(RemoteWebDriver.java:417) at org.openqa.selenium.By$ById.findElement(By.java:218) at org.openqa.selenium.remote.RemoteWebDriver.findElement(RemoteWebDriver.java:360) at org.eclipse.che.selenium.core.SeleniumWebDriver.findElement(SeleniumWebDriver.java:133) at org.openqa.selenium.support.ui.ExpectedConditions.findElement(ExpectedConditions.java:895) at org.openqa.selenium.support.ui.ExpectedConditions.access$000(ExpectedConditions.java:41) at org.openqa.selenium.support.ui.ExpectedConditions$7.apply(ExpectedConditions.java:205) at org.openqa.selenium.support.ui.ExpectedConditions$7.apply(ExpectedConditions.java:201) at org.openqa.selenium.support.ui.FluentWait.until(FluentWait.java:238) ... 18 more ... Removed 13 stack frames
com.redhat.che.functional.tests.BayesianPomXml
checkErrorPresentAfterReopenFile
org.testng.SkipException: Bayesian error not present - known issue: https://github.com/redhat-developer/rh-che/issues/1256. at com.redhat.che.functional.tests.BayesianPomXml.editorCheckBayesianError(BayesianPomXml.java:85) at com.redhat.che.functional.tests.BayesianAbstractTestClass.checkErrorPresentAfterReopenFile(BayesianAbstractTestClass.java:108) at java.util.concurrent.ThreadPoolExecutor.runWorker(ThreadPoolExecutor.java:1149) at java.util.concurrent.ThreadPoolExecutor$Worker.run(ThreadPoolExecutor.java:624) at java.lang.Thread.run(Thread.java:748) ... Removed 10 stack frames
com.redhat.che.functional.tests.BuildAndRunProjectTest
runProjectBuild
com.redhat.che.functional.tests.BayesianPomXml
checkBayesianError
com.redhat.che.functional.tests.BayesianPackageJson
checkBayesianError
checkErrorPresentAfterReopenFile
com.redhat.che.functional.tests.Che7DialogAbout
openDialogAbout
/root/rh-che/functional-tests/src/test/resources/suites/simpleTestSuite.xml
<?xml version="1.0" encoding="UTF-8"?>
<!DOCTYPE suite SYSTEM "http://testng.org/testng-1.0.dtd">
<suite thread-count="1" configfailurepolicy="continue" verbose="0" name="Simple test suite" parallel="classes">
  <test name="all">
    <groups>
      <run>
        <exclude name="github"/>
      </run>
    </groups>
    <classes>
      <class name="org.eclipse.che.selenium.miscellaneous.DialogAboutTest"/>
      <class name="com.redhat.che.functional.tests.BuildAndRunProjectTest"/>
      <class name="com.redhat.che.functional.tests.BayesianPackageJson"/>
      <class name="com.redhat.che.functional.tests.BayesianPomXml"/>
      <class name="com.redhat.che.functional.tests.Che7DialogAbout"/>
    </classes>
  </test> <!-- all -->
</suite> <!-- Simple test suite -->
            
Tests for Simple test suite
  • all (5 classes)
Groups for Simple test suite
Times for Simple test suite
Total running time: 6 minutes
Reporter output for Simple test suite
0 ignored methods
Methods in chronological order
org.eclipse.che.selenium.miscellaneous.DialogAboutTest
dialogAboutTest 0 ms
com.redhat.che.functional.tests.BuildAndRunProjectTest
checkWorkspace 285665 ms
runProjectBuild 348679 ms
com.redhat.che.functional.tests.BayesianPackageJson
setUp 387237 ms
prepareProjectFile 461211 ms
checkBayesianError 482892 ms
closeFiles 494295 ms
prepareProjectFile 510627 ms
checkErrorPresentAfterReopenFile 532162 ms
closeFiles 556475 ms
closeBrowserAfterTest 572697 ms
com.redhat.che.functional.tests.BayesianPomXml
setUp 572751 ms
prepareProjectFile 636016 ms
checkBayesianError 663168 ms
closeFiles 675050 ms
prepareProjectFile 696808 ms
checkErrorPresentAfterReopenFile 721358 ms
closeFiles 756663 ms
closeBrowserAfterTest 778339 ms
com.redhat.che.functional.tests.Che7DialogAbout
createAndOpenWorkspace 778393 ms
openDialogAbout 839850 ms
tearDown 840975 ms