Test results
1 suite, 1 failed test
com.redhat.che.functional.tests.BayesianPackageJson
checkBayesianError
org.openqa.selenium.TimeoutException: Expected condition failed: waiting for visibility of Proxy element for: DefaultElementLocator 'By.cssSelector: span.tooltipTitle' (tried for 10 second(s) with 500 MILLISECONDS interval) Build info: version: '3.0.1', revision: '1969d75', time: '2016-10-18 09:49:13 -0700' System info: host: '86a69aaa081d', ip: '172.17.0.2', os.name: 'Linux', os.arch: 'amd64', os.version: '3.10.0-957.10.1.el7.x86_64', java.version: '1.8.0_201' Driver info: org.eclipse.che.selenium.core.SeleniumWebDriver at org.openqa.selenium.support.ui.WebDriverWait.timeoutException(WebDriverWait.java:80) at org.openqa.selenium.support.ui.FluentWait.until(FluentWait.java:265) at org.eclipse.che.selenium.core.webdriver.SeleniumWebDriverHelper.waitVisibility(SeleniumWebDriverHelper.java:172) at org.eclipse.che.selenium.core.webdriver.SeleniumWebDriverHelper.waitVisibilityAndGetText(SeleniumWebDriverHelper.java:601) at org.eclipse.che.selenium.core.webdriver.SeleniumWebDriverHelper.lambda$waitTextContains$14(SeleniumWebDriverHelper.java:811) at org.openqa.selenium.support.ui.FluentWait.until(FluentWait.java:238) at org.eclipse.che.selenium.core.webdriver.SeleniumWebDriverHelper.waitTextContains(SeleniumWebDriverHelper.java:808) at org.eclipse.che.selenium.core.webdriver.SeleniumWebDriverHelper.waitTextContains(SeleniumWebDriverHelper.java:825) at org.eclipse.che.selenium.pageobject.CodenvyEditor.waitTextInToolTipPopup(CodenvyEditor.java:513) at com.redhat.che.functional.tests.BayesianAbstractTestClass.editorCheckBayesianError(BayesianAbstractTestClass.java:137) at com.redhat.che.functional.tests.BayesianAbstractTestClass.checkBayesianError(BayesianAbstractTestClass.java:110) at java.util.concurrent.ThreadPoolExecutor.runWorker(ThreadPoolExecutor.java:1149) at java.util.concurrent.ThreadPoolExecutor$Worker.run(ThreadPoolExecutor.java:624) at java.lang.Thread.run(Thread.java:748) Caused by: org.openqa.selenium.NoSuchElementException: no such element: Unable to locate element: {"method":"css selector","selector":"span.tooltipTitle"} (Session info: chrome=73.0.3683.103) (Driver info: chromedriver=71.0.3578.98,platform=Linux 3.10.0-957.10.1.el7.x86_64 x86_64) (WARNING: The server did not provide any stacktrace information) Command duration or timeout: 55 milliseconds For documentation on this error, please visit: http://seleniumhq.org/exceptions/no_such_element.html Build info: version: '3.0.1', revision: '1969d75', time: '2016-10-18 09:49:13 -0700' System info: host: '86a69aaa081d', ip: '172.17.0.2', os.name: 'Linux', os.arch: 'amd64', os.version: '3.10.0-957.10.1.el7.x86_64', java.version: '1.8.0_201' Driver info: org.openqa.selenium.remote.RemoteWebDriver Capabilities [{mobileEmulationEnabled=false, hasTouchScreen=false, platform=LINUX, acceptSslCerts=false, goog:chromeOptions={debuggerAddress=localhost:41809}, acceptInsecureCerts=false, webStorageEnabled=true, browserName=chrome, takesScreenshot=true, javascriptEnabled=true, setWindowRect=true, unexpectedAlertBehaviour=, applicationCacheEnabled=false, rotatable=false, networkConnectionEnabled=false, chrome={chromedriverVersion=71.0.3578.98, userDataDir=/tmp/.org.chromium.Chromium.y9pHTU}, takesHeapSnapshot=true, pageLoadStrategy=normal, databaseEnabled=false, handlesAlerts=true, version=73.0.3683.103, browserConnectionEnabled=false, nativeEvents=true, locationContextEnabled=true, cssSelectorsEnabled=true}] Session ID: 3da3ba504ff10a8d7e0a056aae111380 *** Element info: {Using=css selector, value=span.tooltipTitle} at org.openqa.selenium.remote.ErrorHandler.createThrowable(ErrorHandler.java:216) at org.openqa.selenium.remote.ErrorHandler.throwIfResponseFailed(ErrorHandler.java:168) at org.openqa.selenium.remote.RemoteWebDriver.execute(RemoteWebDriver.java:635) at org.openqa.selenium.remote.RemoteWebDriver.findElement(RemoteWebDriver.java:368) at org.openqa.selenium.remote.RemoteWebDriver.findElementByCssSelector(RemoteWebDriver.java:465) at org.openqa.selenium.By$ByCssSelector.findElement(By.java:430) at org.openqa.selenium.remote.RemoteWebDriver.findElement(RemoteWebDriver.java:360) at org.eclipse.che.selenium.core.SeleniumWebDriver.findElement(SeleniumWebDriver.java:133) at org.openqa.selenium.support.pagefactory.DefaultElementLocator.findElement(DefaultElementLocator.java:69) at org.openqa.selenium.support.pagefactory.internal.LocatingElementHandler.invoke(LocatingElementHandler.java:38) at com.sun.proxy.$Proxy37.isDisplayed(Unknown Source) at org.openqa.selenium.support.ui.ExpectedConditions.elementIfVisible(ExpectedConditions.java:302) at org.openqa.selenium.support.ui.ExpectedConditions.access$100(ExpectedConditions.java:41) at org.openqa.selenium.support.ui.ExpectedConditions$10.apply(ExpectedConditions.java:288) at org.openqa.selenium.support.ui.ExpectedConditions$10.apply(ExpectedConditions.java:285) at org.openqa.selenium.support.ui.FluentWait.until(FluentWait.java:238) ... 22 more ... Removed 13 stack frames
com.redhat.che.functional.tests.BayesianPomXml
checkErrorPresentAfterReopenFile
org.testng.SkipException: Bayesian error not present - known issue: https://github.com/redhat-developer/rh-che/issues/1256. at com.redhat.che.functional.tests.BayesianPomXml.editorCheckBayesianError(BayesianPomXml.java:85) at com.redhat.che.functional.tests.BayesianAbstractTestClass.checkErrorPresentAfterReopenFile(BayesianAbstractTestClass.java:118) at java.util.concurrent.ThreadPoolExecutor.runWorker(ThreadPoolExecutor.java:1149) at java.util.concurrent.ThreadPoolExecutor$Worker.run(ThreadPoolExecutor.java:624) at java.lang.Thread.run(Thread.java:748) ... Removed 10 stack frames
com.redhat.che.functional.tests.BuildAndRunProjectTest
runProjectBuild
com.redhat.che.functional.tests.BayesianPackageJson
checkErrorPresentAfterReopenFile
org.eclipse.che.selenium.miscellaneous.DialogAboutTest
dialogAboutTest
com.redhat.che.functional.tests.BayesianPomXml
checkBayesianError
/root/rh-che/functional-tests/src/test/resources/suites/simpleTestSuite.xml
<?xml version="1.0" encoding="UTF-8"?>
<!DOCTYPE suite SYSTEM "http://testng.org/testng-1.0.dtd">
<suite thread-count="1" configfailurepolicy="continue" verbose="0" name="Simple test suite" parallel="classes">
  <test name="all">
    <groups>
      <run>
        <exclude name="github"/>
      </run>
    </groups>
    <classes>
      <class name="org.eclipse.che.selenium.miscellaneous.DialogAboutTest"/>
      <class name="com.redhat.che.functional.tests.BuildAndRunProjectTest"/>
      <class name="com.redhat.che.functional.tests.BayesianPackageJson"/>
      <class name="com.redhat.che.functional.tests.BayesianPomXml"/>
    </classes>
  </test> <!-- all -->
</suite> <!-- Simple test suite -->
            
Tests for Simple test suite
  • all (4 classes)
Groups for Simple test suite
Times for Simple test suite
Total running time: 3 minutes
Reporter output for Simple test suite
0 ignored methods
Methods in chronological order
org.eclipse.che.selenium.miscellaneous.DialogAboutTest
dialogAboutTest 0 ms
com.redhat.che.functional.tests.BuildAndRunProjectTest
checkWorkspace 51776 ms
runProjectBuild 124599 ms
com.redhat.che.functional.tests.BayesianPackageJson
setUp 164154 ms
prepareProjectFile 241723 ms
checkBayesianError 265440 ms
closeFiles 289547 ms
prepareProjectFile 307129 ms
checkErrorPresentAfterReopenFile 329372 ms
closeFiles 354881 ms
closeBrowserAfterTest 372022 ms
com.redhat.che.functional.tests.BayesianPomXml
setUp 372079 ms
prepareProjectFile 455187 ms
checkBayesianError 484585 ms
closeFiles 497321 ms
prepareProjectFile 520558 ms
checkErrorPresentAfterReopenFile 548787 ms
closeFiles 585299 ms
closeBrowserAfterTest 608421 ms