Test results
1 suite, 2 failed tests
com.redhat.che.functional.tests.BayesianPackageJson
checkBayesianError
org.openqa.selenium.TimeoutException: Expected condition failed: actual text: 'Package serve-static-1.7.1 is vulnerable: CVE-2015-1164. Recommendation: use version 1.13.2' didn't contain: 'Package serve-static-1.7.1 is vulnerable: CVE-2015-1164. Recommendation: use version 1.7.2' (tried for 10 second(s) with 500 MILLISECONDS interval) Build info: version: '3.0.1', revision: '1969d75', time: '2016-10-18 09:49:13 -0700' System info: host: 'b0a26e35d33a', ip: '172.17.0.2', os.name: 'Linux', os.arch: 'amd64', os.version: '3.10.0-957.10.1.el7.x86_64', java.version: '1.8.0_201' Driver info: org.eclipse.che.selenium.core.SeleniumWebDriver at org.openqa.selenium.support.ui.WebDriverWait.timeoutException(WebDriverWait.java:80) at org.openqa.selenium.support.ui.FluentWait.until(FluentWait.java:265) at org.eclipse.che.selenium.core.webdriver.SeleniumWebDriverHelper.waitTextContains(SeleniumWebDriverHelper.java:808) at org.eclipse.che.selenium.core.webdriver.SeleniumWebDriverHelper.waitTextContains(SeleniumWebDriverHelper.java:825) at org.eclipse.che.selenium.pageobject.CodenvyEditor.waitTextInToolTipPopup(CodenvyEditor.java:513) at com.redhat.che.functional.tests.BayesianAbstractTestClass.editorCheckBayesianError(BayesianAbstractTestClass.java:134) at com.redhat.che.functional.tests.BayesianAbstractTestClass.checkBayesianError(BayesianAbstractTestClass.java:107) at java.util.concurrent.ThreadPoolExecutor.runWorker(ThreadPoolExecutor.java:1149) at java.util.concurrent.ThreadPoolExecutor$Worker.run(ThreadPoolExecutor.java:624) at java.lang.Thread.run(Thread.java:748) ... Removed 10 stack frames
checkErrorPresentAfterReopenFile
org.openqa.selenium.TimeoutException: Expected condition failed: actual text: 'Package serve-static-1.7.1 is vulnerable: CVE-2015-1164. Recommendation: use version 1.13.2' didn't contain: 'Package serve-static-1.7.1 is vulnerable: CVE-2015-1164. Recommendation: use version 1.7.2' (tried for 10 second(s) with 500 MILLISECONDS interval) Build info: version: '3.0.1', revision: '1969d75', time: '2016-10-18 09:49:13 -0700' System info: host: 'b0a26e35d33a', ip: '172.17.0.2', os.name: 'Linux', os.arch: 'amd64', os.version: '3.10.0-957.10.1.el7.x86_64', java.version: '1.8.0_201' Driver info: org.eclipse.che.selenium.core.SeleniumWebDriver at org.openqa.selenium.support.ui.WebDriverWait.timeoutException(WebDriverWait.java:80) at org.openqa.selenium.support.ui.FluentWait.until(FluentWait.java:265) at org.eclipse.che.selenium.core.webdriver.SeleniumWebDriverHelper.waitTextContains(SeleniumWebDriverHelper.java:808) at org.eclipse.che.selenium.core.webdriver.SeleniumWebDriverHelper.waitTextContains(SeleniumWebDriverHelper.java:825) at org.eclipse.che.selenium.pageobject.CodenvyEditor.waitTextInToolTipPopup(CodenvyEditor.java:513) at com.redhat.che.functional.tests.BayesianAbstractTestClass.editorCheckBayesianError(BayesianAbstractTestClass.java:134) at com.redhat.che.functional.tests.BayesianAbstractTestClass.checkErrorPresentAfterReopenFile(BayesianAbstractTestClass.java:115) at java.util.concurrent.ThreadPoolExecutor.runWorker(ThreadPoolExecutor.java:1149) at java.util.concurrent.ThreadPoolExecutor$Worker.run(ThreadPoolExecutor.java:624) at java.lang.Thread.run(Thread.java:748) ... Removed 10 stack frames
com.redhat.che.functional.tests.BayesianPomXml
checkErrorPresentAfterReopenFile
org.testng.SkipException: Bayesian error not present - known issue: https://github.com/redhat-developer/rh-che/issues/1256. at com.redhat.che.functional.tests.BayesianPomXml.editorCheckBayesianError(BayesianPomXml.java:85) at com.redhat.che.functional.tests.BayesianAbstractTestClass.checkErrorPresentAfterReopenFile(BayesianAbstractTestClass.java:115) at java.util.concurrent.ThreadPoolExecutor.runWorker(ThreadPoolExecutor.java:1149) at java.util.concurrent.ThreadPoolExecutor$Worker.run(ThreadPoolExecutor.java:624) at java.lang.Thread.run(Thread.java:748) ... Removed 10 stack frames
com.redhat.che.functional.tests.BuildAndRunProjectTest
runProjectBuild
org.eclipse.che.selenium.miscellaneous.DialogAboutTest
dialogAboutTest
com.redhat.che.functional.tests.Che7DialogAbout
openDialogAbout
com.redhat.che.functional.tests.BayesianPomXml
checkBayesianError
/root/rh-che/functional-tests/src/test/resources/suites/simpleTestSuite.xml
<?xml version="1.0" encoding="UTF-8"?>
<!DOCTYPE suite SYSTEM "http://testng.org/testng-1.0.dtd">
<suite thread-count="1" configfailurepolicy="continue" verbose="0" name="Simple test suite" parallel="classes">
  <test name="all">
    <groups>
      <run>
        <exclude name="github"/>
      </run>
    </groups>
    <classes>
      <class name="org.eclipse.che.selenium.miscellaneous.DialogAboutTest"/>
      <class name="com.redhat.che.functional.tests.BuildAndRunProjectTest"/>
      <class name="com.redhat.che.functional.tests.BayesianPackageJson"/>
      <class name="com.redhat.che.functional.tests.BayesianPomXml"/>
      <class name="com.redhat.che.functional.tests.Che7DialogAbout"/>
    </classes>
  </test> <!-- all -->
</suite> <!-- Simple test suite -->
            
Tests for Simple test suite
  • all (5 classes)
Groups for Simple test suite
Times for Simple test suite
Total running time: 3 minutes
Reporter output for Simple test suite
0 ignored methods
Methods in chronological order
org.eclipse.che.selenium.miscellaneous.DialogAboutTest
dialogAboutTest 0 ms
com.redhat.che.functional.tests.BuildAndRunProjectTest
checkWorkspace 70004 ms
runProjectBuild 143170 ms
com.redhat.che.functional.tests.BayesianPackageJson
setUp 183194 ms
prepareProjectFile 262160 ms
checkBayesianError 284941 ms
closeFiles 308833 ms
prepareProjectFile 326618 ms
checkErrorPresentAfterReopenFile 349122 ms
closeFiles 385803 ms
closeBrowserAfterTest 403775 ms
com.redhat.che.functional.tests.BayesianPomXml
setUp 403830 ms
prepareProjectFile 474083 ms
checkBayesianError 502510 ms
closeFiles 515050 ms
prepareProjectFile 538459 ms
checkErrorPresentAfterReopenFile 566452 ms
closeFiles 602966 ms
closeBrowserAfterTest 626638 ms
com.redhat.che.functional.tests.Che7DialogAbout
createAndOpenWorkspace 626693 ms
openDialogAbout 677836 ms
tearDown 678922 ms