Test results
1 suite, 1 failed test
com.redhat.che.functional.tests.BuildAndRunProjectTest
runProjectBuild
org.openqa.selenium.TimeoutException: Expected condition failed: actual text: '[INFO] Scanning for projects... [ERROR] [ERROR] Some problems were encountered while processing the POMs: [FATAL] Non-readable POM /projects/vertx-http-booster/pom.xml: /projects/vertx-http-booster/pom.xml (No such file or directory) @ @ [ERROR] The build could not read 1 project -> [Help 1] [ERROR] [ERROR] The project (/projects/vertx-http-booster/pom.xml) has 1 error [ERROR] Non-readable POM /projects/vertx-http-booster/pom.xml: /projects/vertx-http-booster/pom.xml (No such file or directory) [ERROR] [ERROR] To see the full stack trace of the errors, re-run Maven with the -e switch. [ERROR] Re-run Maven using the -X switch to enable full debug logging. [ERROR] [ERROR] For more information about the errors and possible solutions, please read the following articles: [ERROR] [Help 1] http://cwiki.apache.org/confluence/display/MAVEN/ProjectBuildingException' didn't contain: 'INFO: Succeeded in deploying verticle' (tried for 180 second(s) with 500 MILLISECONDS interval) Build info: version: '3.0.1', revision: '1969d75', time: '2016-10-18 09:49:13 -0700' System info: host: '9329650d7ae7', ip: '172.17.0.2', os.name: 'Linux', os.arch: 'amd64', os.version: '3.10.0-957.5.1.el7.x86_64', java.version: '1.8.0_201' Driver info: org.eclipse.che.selenium.core.SeleniumWebDriver at org.openqa.selenium.support.ui.WebDriverWait.timeoutException(WebDriverWait.java:80) at org.openqa.selenium.support.ui.FluentWait.until(FluentWait.java:265) at org.eclipse.che.selenium.core.webdriver.SeleniumWebDriverHelper.waitTextContains(SeleniumWebDriverHelper.java:808) at org.eclipse.che.selenium.pageobject.Consoles.waitExpectedTextIntoConsole(Consoles.java:487) at com.redhat.che.functional.tests.BuildAndRunProjectTest.runProjectBuild(BuildAndRunProjectTest.java:65) at java.util.concurrent.ThreadPoolExecutor.runWorker(ThreadPoolExecutor.java:1149) at java.util.concurrent.ThreadPoolExecutor$Worker.run(ThreadPoolExecutor.java:624) at java.lang.Thread.run(Thread.java:748) ... Removed 10 stack frames
/root/che/functional-tests/src/test/resources/suites/prcheck.xml
<?xml version="1.0" encoding="UTF-8"?>
<!DOCTYPE suite SYSTEM "http://testng.org/testng-1.0.dtd">
<suite thread-count="1" configfailurepolicy="continue" verbose="0" name="Suite for PR check" parallel="classes">
  <test name="all">
    <groups>
      <run>
        <exclude name="github"/>
      </run>
    </groups>
    <classes>
      <class name="com.redhat.che.functional.tests.BuildAndRunProjectTest"/>
    </classes>
  </test> <!-- all -->
</suite> <!-- Suite for PR check -->
            
Tests for Suite for PR check
  • all (1 class)
Groups for Suite for PR check
Times for Suite for PR check
Total running time: 3 minutes
Reporter output for Suite for PR check
0 ignored methods
Methods in chronological order
com.redhat.che.functional.tests.BuildAndRunProjectTest
checkWorkspace 0 ms
runProjectBuild 416824 ms